• Announcements

    • andrewilley

      Poweramp v3 Project Update   03/22/2017

      As you may be aware, the Poweramp developer has been working hard on an updated material design user interface for Poweramp v3 which required a full ground-up rebuild of the code. It's not quite ready for open testing yet, and although he would like to be able to get it out by the end of the March it may just drop over into April. See forum thread for more details and to discuss.    

picasso_ap4ak

New Members
  • Content count

    1
  • Joined

  • Last visited

About picasso_ap4ak

  • Rank
    Newbie
  • Birthday 08/20/1989

Contact Methods

  • ICQ 457999969
  • Skype ippacco_gun

Profile Information

  • Gender Male
  • Location Volgograd Region
  1. Error: No resource found. BUILD FAILED

    Hello! Please help with the build a skin -code-gen: [echo] SKIN: Generating R.java / Manifest.java from the resources... [exec] C:\powerampapi-master\poweramp_skin_sdk\skin_picasso\res\values\default_styles.xml:231: error: Error: No resource found that matches the given name: attr 'AlbumArtAnimator'. [exec] [exec] C:\powerampapi-master\poweramp_skin_sdk\skin_picasso\res\values\default_styles.xml:487: error: Error: No resource found that matches the given name: attr 'default_bg'. [exec] [exec] C:\powerampapi-master\poweramp_skin_sdk\skin_picasso\res\values\default_styles.xml:494: error: Error: No resource found that matches the given name: attr 'coverMarginBottom'. [exec] [exec] C:\powerampapi-master\poweramp_skin_sdk\skin_picasso\res\values\default_styles.xml:493: error: Error: No resource found that matches the given name: attr 'coverPadding'. [exec] [exec] C:\powerampapi-master\poweramp_skin_sdk\skin_picasso\res\values\default_styles.xml:492: error: Error: No resource found that matches the given name: attr 'coverScaleInt'. [exec]BUILD FAILEDC:\powerampapi-master\poweramp_skin_sdk\skin_picasso\build.xml:33: exec returned: 1Total time: 5 secondsC:\powerampapi-master\poweramp_skin_sdk\skin_picasso>This is one of the first attempts to build, I'm a noob. What am I doing wrong? Прошу помощи!